BDBM83248 Acetic acid 3-(6-nitro-1,3-dioxo-1H,3H-benzo[de]isoquinolin-2-yl)-phenyl ester::MLS001212837::SMR000514298::[3-(6-nitro-1,3-dioxobenzo[de]isoquinolin-2-yl)phenyl] acetate::[3-[6-nitro-1,3-bis(oxidanylidene)benzo[de]isoquinolin-2-yl]phenyl] ethanoate::acetic acid [3-(1,3-diketo-6-nitro-benzo[de]isoquinolin-2-yl)phenyl] ester::acetic acid [3-(6-nitro-1,3-dioxo-2-benzo[de]isoquinolinyl)phenyl] ester::cid_1103612
SMILES CC(=O)Oc1cccc(c1)N1C(=O)c2cccc3c(ccc(C1=O)c23)[N+]([O-])=O
InChI Key InChIKey=OLNLUYUTPMOILY-UHFFFAOYSA-N
Data  2 IC50
  Tab Delimited (TSV)   2D SDfile   Computed 3D by Vconf -m prep SDfile
Find this compound or compounds like it in BindingDB:
Activity Spreadsheet -- Enzyme Inhibition Constant Data from BindingDB
Found 2 hits for monomerid = 83248
TargetBeta-lactamase(Pseudomonas aeruginosa)
The Scripps Research Institute Molecular Screening Center
Curated by PubChem BioAssay
LigandPNGBDBM83248(Acetic acid 3-(6-nitro-1,3-dioxo-1H,3H-benzo[de]is...)
Affinity DataIC50:  4.50E+3nM. Assay description: Source (MLPCN Center Name): The Scripps Research Institute Molecular Screening Center (SRIMSC) Affiliation: The Scripps Research Institute, TSRI Assa...
In DepthDetails PCBioAssay
TargetToll-like receptor 9(Homo sapiens (Human))
The Scripps Research Institute Molecular Screening Center
Curated by PubChem BioAssay
LigandPNGBDBM83248(Acetic acid 3-(6-nitro-1,3-dioxo-1H,3H-benzo[de]is...)
Affinity DataIC50:  4.14E+3nM. Assay description: Source (MLPCN Center Name): The Scripps Research Institute Molecular Screening Center (SRIMSC) Affiliation: The Scripps Research Institute, TSRI Assa...
In DepthDetails PCBioAssay