BDBM83382 MLS000775512::N-[2-(dimethylamino)-2-(4-methoxyphenyl)ethyl]-4-(dimethylsulfamoyl)benzamide::SMR000370403::cid_4885516
SMILES COc1ccc(cc1)C(CNC(=O)c1ccc(cc1)S(=O)(=O)N(C)C)N(C)C
InChI Key InChIKey=QAODNASOOKMGMA-UHFFFAOYSA-N
Data  1 EC50
  Tab Delimited (TSV)   2D SDfile   Computed 3D by Vconf -m prep SDfile
Find this compound or compounds like it in BindingDB:
Activity Spreadsheet -- Enzyme Inhibition Constant Data from BindingDB
Found 1 hit for monomerid = 83382
TargetDelta-type opioid receptor(Homo sapiens (Human))
The Scripps Research Institute Molecular Screening Center
Curated by PubChem BioAssay
LigandPNGBDBM83382(MLS000775512 | N-[2-(dimethylamino)-2-(4-methoxyph...)
Affinity DataEC50:  8.56E+4nM. Assay description: Source (MLPCN Center Name): The Scripps Research Institute Molecular Screening Center (SRIMSC) Affiliation: The Scripps Research Institute, TSRI Assa...
In DepthDetails PCBioAssay