BDBM83732 6-cyclohexyl-3-(3,4-dimethoxyphenyl)-[1,2,4]triazolo[3,4-b][1,3,4]thiadiazole::MLS000041163::SMR000043840::cid_663173
SMILES COc1ccc(cc1OC)-c1nnc2sc(nn12)C1CCCCC1
InChI Key InChIKey=PGVLSBWGTPEDPF-UHFFFAOYSA-N
Data  1 EC50
  Tab Delimited (TSV)   2D SDfile   Computed 3D by Vconf -m prep SDfile
Find this compound or compounds like it in BindingDB:
Activity Spreadsheet -- Enzyme Inhibition Constant Data from BindingDB
Found 1 hit for monomerid = 83732
TargetOrotidine 5'-phosphate decarboxylase(Aspergillus niger)
The Scripps Research Institute Molecular Screening Center
Curated by PubChem BioAssay
LigandPNGBDBM83732(6-cyclohexyl-3-(3,4-dimethoxyphenyl)-[1,2,4]triazo...)
Affinity DataEC50: >5.97E+4nM. Assay description: Source (MLPCN Center Name): The Scripps Research Institute Molecular Screening Center (SRISMC) Center Affiliation: The Scripps Research Institute, TS...
In DepthDetails PCBioAssay