BDBM83983 MLS002181643::N-[[5-(2-chlorophenyl)-1,3,4-oxadiazol-2-yl]methyl]-N-cyclopropyl-5-nitro-2-furamide::N-[[5-(2-chlorophenyl)-1,3,4-oxadiazol-2-yl]methyl]-N-cyclopropyl-5-nitro-2-furancarboxamide::N-[[5-(2-chlorophenyl)-1,3,4-oxadiazol-2-yl]methyl]-N-cyclopropyl-5-nitro-furan-2-carboxamide::N-[[5-(2-chlorophenyl)-1,3,4-oxadiazol-2-yl]methyl]-N-cyclopropyl-5-nitrofuran-2-carboxamide::SMR001270673::cid_25162287
SMILES [O-][N+](=O)c1ccc(o1)C(=O)N(Cc1nnc(o1)-c1ccccc1Cl)C1CC1
InChI Key InChIKey=GMQBNYKIKWTLJQ-UHFFFAOYSA-N
Data  2 IC50
  Tab Delimited (TSV)   2D SDfile   Computed 3D by Vconf -m prep SDfile
Find this compound or compounds like it in BindingDB:
Activity Spreadsheet -- Enzyme Inhibition Constant Data from BindingDB
Found 2 hits for monomerid = 83983
TargetApoptotic protease-activating factor 1(Homo sapiens (Human))
Burnham Center For Chemical Genomics
Curated by PubChem BioAssay
LigandPNGBDBM83983(MLS002181643 | N-[[5-(2-chlorophenyl)-1,3,4-oxadia...)
Affinity DataIC50: >1.00E+5nM. Assay description: Data Source: Sanford-Burnham Center for Chemical Genomics (SBCCG) Source Affiliation: Sanford-Burnham Medical Research Institute (SBIMR, San Diego, C...
In DepthDetails PCBioAssay
TargetApoptotic protease-activating factor 1(Homo sapiens (Human))
Burnham Center For Chemical Genomics
Curated by PubChem BioAssay
LigandPNGBDBM83983(MLS002181643 | N-[[5-(2-chlorophenyl)-1,3,4-oxadia...)
Affinity DataIC50: >1.00E+5nM. Assay description: Data Source: Sanford-Burnham Center for Chemical Genomics (SBCCG) Source Affiliation: Sanford-Burnham Medical Research Institute (SBIMR, San Diego, C...
In DepthDetails PCBioAssay