BDBM84077 MLS-0454650.0002::N-cyclohexyl-2-(1H-indol-3-yl)-2-keto-N-methyl-acetamide::N-cyclohexyl-2-(1H-indol-3-yl)-N-methyl-2-oxidanylidene-ethanamide::N-cyclohexyl-2-(1H-indol-3-yl)-N-methyl-2-oxoacetamide::cid_7034421
SMILES CN(C1CCCCC1)C(=O)C(=O)c1c[nH]c2ccccc12
InChI Key InChIKey=ODAIEHHBAGBDAV-UHFFFAOYSA-N
Data  1 IC50
  Tab Delimited (TSV)   2D SDfile   Computed 3D by Vconf -m prep SDfile
Find this compound or compounds like it in BindingDB:
Activity Spreadsheet -- Enzyme Inhibition Constant Data from BindingDB
Found 1 hit for monomerid = 84077
TargetSentrin-specific protease 8(Homo sapiens (Human))
Burnham Center For Chemical Genomics
Curated by PubChem BioAssay
LigandPNGBDBM84077(MLS-0454650.0002 | N-cyclohexyl-2-(1H-indol-3-yl)-...)
Affinity DataIC50: >9.90E+4nM. Assay description: Data Source: Sanford-Burnham Center for Chemical Genomics (SBCCG) Source Affiliation: Sanford-Burnham Medical Research Institute (SBMRI, San Diego, C...
In DepthDetails PCBioAssay