BDBM84162 2-Ethyl-N-[2-(4-methoxy-phenyl)-ethyl]-N-(4-oxo-3,4-dihydro-quinazolin-2-ylmethyl)-butyramide::2-ethyl-N-[(4-keto-1H-quinazolin-2-yl)methyl]-N-[2-(4-methoxyphenyl)ethyl]butyramide::2-ethyl-N-[2-(4-methoxyphenyl)ethyl]-N-[(4-oxidanylidene-1H-quinazolin-2-yl)methyl]butanamide::2-ethyl-N-[2-(4-methoxyphenyl)ethyl]-N-[(4-oxo-1H-quinazolin-2-yl)methyl]butanamide::MLS000067238::SMR000124708::cid_1454226
SMILES CCC(CC)C(=O)N(CCc1ccc(OC)cc1)Cc1nc2ccccc2c(=O)[nH]1
InChI Key InChIKey=FXDFILYMXFDXNE-UHFFFAOYSA-N
Data  1 IC50
  Tab Delimited (TSV)   2D SDfile   Computed 3D by Vconf -m prep SDfile
Find this compound or compounds like it in BindingDB:
Activity Spreadsheet -- Enzyme Inhibition Constant Data from BindingDB
Found 1 hit for monomerid = 84162
TargetPotassium voltage-gated channel subfamily KQT member 2(Rattus norvegicus)
Johns Hopkins Ion Channel Center
Curated by PubChem BioAssay
LigandPNGBDBM84162(2-Ethyl-N-[2-(4-methoxy-phenyl)-ethyl]-N-(4-oxo-3,...)
Affinity DataIC50:  1.24E+4nM. Assay description: Source (MLPCN Center Name): Johns Hopkins Ion Channel Center (JHICC_KCNQ2_Inh_HFCP_IWS_CRC) Center Affiliation: Johns Hopkins University, School of M...
In DepthDetails PCBioAssay