BDBM8424 2-[(5Z)-4-oxo-5-{[5-(4-sulfamoylphenyl)furan-2-yl]methylidene}-2-sulfanylidene-1,3-thiazolidin-3-yl]acetic acid::Rhodanine-furan analogue 11
SMILES NS(=O)(=O)c1ccc(cc1)-c1ccc(\C=C2/SC(=S)N(CC(O)=O)C2=O)o1
InChI Key InChIKey=INTRPSYVRVQXSB-QPEQYQDCSA-N
Data  1 IC50
  Tab Delimited (TSV)   2D SDfile   Computed 3D by Vconf -m prep SDfile
Find this compound or compounds like it in BindingDB:
Activity Spreadsheet -- Enzyme Inhibition Constant Data from BindingDB
Found 1 hit for monomerid = 8424
TargetLethal factor(Bacillus anthracis)
Burnham Institute For Medical Research
LigandPNGBDBM8424(2-[(5Z)-4-oxo-5-{[5-(4-sulfamoylphenyl)furan-2-yl]...)
Affinity DataIC50:  9.10E+3nMpH: 7.4 T: 2°C. Assay description: Fluorescence peptide cleavage assay was performed in a 96-well plate. Each reaction contained MAPKKide, LF, and the small-molecule inhibitor. The C-t...
In DepthDetails ArticlePubMed