BDBM84384 N-[2-methyl-5-(5-methyl-1,3-benzoxazol-2-yl)phenyl]-2-(2-thienyl)acetamide::cid_1026560
SMILES Cc1ccc2oc(nc2c1)-c1ccc(C)c(NC(=O)Cc2cccs2)c1
InChI Key InChIKey=JRZUETATZWRLGT-UHFFFAOYSA-N
Data  1 IC50
  Tab Delimited (TSV)   2D SDfile   Computed 3D by Vconf -m prep SDfile
Find this compound or compounds like it in BindingDB:
Activity Spreadsheet -- Enzyme Inhibition Constant Data from BindingDB
Found 1 hit for monomerid = 84384
TargetSUMO-conjugating enzyme UBC9(Homo sapiens (Human))
Burnham Center For Chemical Genomics
Curated by PubChem BioAssay
LigandPNGBDBM84384(N-[2-methyl-5-(5-methyl-1,3-benzoxazol-2-yl)phenyl...)
Affinity DataIC50:  1.00E+5nM. Assay description: Data Source: Sanford-Burnham Center for Chemical Genomics (SBCCG) Source Affiliation: Sanford-Burnham Medical Research Institute (SBMRI, San Diego, C...
In DepthDetails PCBioAssay