BDBM84598 Dansyl derivative, 2L
SMILES CN(C)c1cccc2c(cccc12)S(=O)(=O)N[C@@H](Cc1cc(I)c(OS(=O)(=O)c2cccc3c(cccc23)N(C)C)c(I)c1)C(O)=O
InChI Key InChIKey=UYXBUNPMAVKNBS-MHZLTWQESA-N
Data  2 KI
  Tab Delimited (TSV)   2D SDfile   Computed 3D by Vconf -m prep SDfile
Find this compound or compounds like it in BindingDB:
Activity Spreadsheet -- Enzyme Inhibition Constant Data from BindingDB
Found 2 hits for monomerid = 84598
TargetThymidylate synthase(Lactobacillus casei)
Università
LigandPNGBDBM84598(Dansyl derivative, 2L)
Affinity DataKi:  4.40E+3nM. Assay description: All compounds were screened for inhibitory activity against Lactobacillus casei thymidylate synthase (LcTS) and Escherichia coli thymidylate synthase...
In DepthDetails ArticlePubMed
TargetThymidylate synthase(Escherichia coli)
Università
LigandPNGBDBM84598(Dansyl derivative, 2L)
Affinity DataKi:  8.20E+3nM. Assay description: All compounds were screened for inhibitory activity against Lactobacillus casei thymidylate synthase (LcTS) and Escherichia coli thymidylate synthase...
In DepthDetails ArticlePubMed