BDBM84727 leuprolide 7NMeLeu
SMILES CCNC(=O)[C@@H]1CCCN1C(=O)[C@H](CCCN=C(N)N)NC(=O)[C@H](CC(C)C)N(C)C(=O)[C@@H](CC(C)C)NC(=O)[C@H](Cc1ccc(O)cc1)NC(=O)[C@H](CO)NC(=O)[C@H](Cc1c[nH]c2ccccc12)NC(=O)[C@H](Cc1cnc[nH]1)NC(=O)[C@@H]1CCC(=O)N1
InChI Key InChIKey=MFKLUQJAHFMULX-XBYJETBVSA-N
Data  1 KI
  Tab Delimited (TSV)   2D SDfile   Computed 3D by Vconf -m prep SDfile
Find this compound or compounds like it in BindingDB:
Activity Spreadsheet -- Enzyme Inhibition Constant Data from BindingDB
Found 1 hit for monomerid = 84727
TargetProgonadoliberin-1(RAT)
Abbott Laboratories
Curated by PDSP Ki Database
LigandPNGBDBM84727(leuprolide 7NMeLeu)
Affinity DataKi:  0.160nM
In DepthDetails ArticlePubMed