BDBM84766 (20) 1H-1,2,4-triazol-3-yl-anilines 3-F3C,4-Cl(C6H4) 4-Pyridine
SMILES FC(F)(F)c1cc(ccc1Cl)-n1cnc(n1)-c1ccccc1Nc1ccncc1
InChI Key InChIKey=IXMRWHWBRPQRHV-UHFFFAOYSA-N
Data  2 IC50
  Tab Delimited (TSV)   2D SDfile   Computed 3D by Vconf -m prep SDfile
Find this compound or compounds like it in BindingDB:
Activity Spreadsheet -- Enzyme Inhibition Constant Data from BindingDB
Found 2 hits for monomerid = 84766
TargetVascular endothelial growth factor receptor 1(Homo sapiens (Human))
Chemdiv
LigandPNGBDBM84766((20) 1H-1,2,4-triazol-3-yl-anilines 3-F3C,4-Cl(C6H...)
Affinity DataIC50:  230nMpH: 7.5 T: 2°C. Assay description: In a representative synthetic procedure (compound 3), a mixture of 1 (330 mg, 2 mM) and 3-F3C-C6H4-NHNH2 (370 mg, 2.1 mM) in anisole (20 mL) was stir...
In DepthDetails ArticlePubMed
TargetVascular endothelial growth factor receptor 2(Homo sapiens (Human))
Chemdiv
LigandPNGBDBM84766((20) 1H-1,2,4-triazol-3-yl-anilines 3-F3C,4-Cl(C6H...)
Affinity DataIC50:  150nMpH: 7.5 T: 2°C. Assay description: In a representative synthetic procedure (compound 3), a mixture of 1 (330 mg, 2 mM) and 3-F3C-C6H4-NHNH2 (370 mg, 2.1 mM) in anisole (20 mL) was stir...
In DepthDetails ArticlePubMed