BDBM84960 Stilbene derivative, 4
SMILES CNc1ccc(\C=C\c2ccc(O)c(O)c2)cc1
InChI Key InChIKey=KUKYUISEEAFPHZ-NSCUHMNNSA-N
Data  1 IC50
  Tab Delimited (TSV)   2D SDfile   Computed 3D by Vconf -m prep SDfile
Find this compound or compounds like it in BindingDB:
Activity Spreadsheet -- Enzyme Inhibition Constant Data from BindingDB
Found 1 hit for monomerid = 84960
TargetAlpha-glucosidase MAL12(Saccharomyces cerevisiae)
Gyeongsang National University
LigandPNGBDBM84960(Stilbene derivative, 4)
Affinity DataIC50: >2.00E+5nM. Assay description: All enzymatic activities were determined by using the appropriate substrate (p-nitrophenyl-alpha-D-glucopyranoside, p-nitrophenyl-beta-D-gulcopyranos...
In DepthDetails ArticlePubMed