BDBM8502 (2R)-2-[(4-fluoro-3-methylbenzene)sulfonamido]-N-hydroxy-2-phenylacetamide::hydroxamate analogue 39
SMILES Cc1cc(ccc1F)S(=O)(=O)N[C@@H](C(=O)NO)c1ccccc1
InChI Key InChIKey=BMHYZABJTWKYPO-CQSZACIVSA-N
Data  1 IC50
  Tab Delimited (TSV)   2D SDfile   Computed 3D by Vconf -m prep SDfile
Find this compound or compounds like it in BindingDB:
Activity Spreadsheet -- Enzyme Inhibition Constant Data from BindingDB
Found 1 hit for monomerid = 8502
TargetLethal factor(Bacillus anthracis)
Merck Research Laboratories
LigandPNGBDBM8502((2R)-2-[(4-fluoro-3-methylbenzene)sulfonamido]-N-h...)
Affinity DataIC50:  50nM. Assay description: The assay was performed in a 96-well plate, each well contained substrate peptide, LF, and the test compound. The C-terminally fluorophore of substra...
Ligand InfoPC cidPC sid
In DepthDetails ArticlePubMed