BDBM85081 12-oxo-LTB4::CAS_5280876::NSC_5280876
SMILES CCCCCCC=CC(=O)C=CC=CC=CC(O)CCCC(O)=O
InChI Key InChIKey=PFAITAZKDRRHRA-UHFFFAOYSA-N
Data  1 KI
  Tab Delimited (TSV)   2D SDfile   Computed 3D by Vconf -m prep SDfile
Find this compound or compounds like it in BindingDB:
Activity Spreadsheet -- Enzyme Inhibition Constant Data from BindingDB
Found 1 hit for monomerid = 85081
TargetLeukotriene B4 receptor 2(Homo sapiens (Human))
The University Of Tokyo
Curated by PDSP Ki Database
LigandPNGBDBM85081(12-oxo-LTB4 | CAS_5280876 | NSC_5280876)
Affinity DataKi:  7.60nM
In DepthDetails ArticlePubMed