BDBM85205 Galanin (1-16)::Galanin (1-16), rat
SMILES CCC(C)C(NC(=O)C(C)NC(=O)C(Cc1cnc[nH]1)NC(=O)C1CCCN1C(=O)CNC(=O)C(CC(C)C)NC(=O)C(CC(C)C)NC(=O)C(Cc1ccc(O)cc1)NC(=O)CNC(=O)C(C)NC(=O)C(CO)NC(=O)C(CC(N)=O)NC(=O)C(CC(C)C)NC(=O)C(NC(=O)C(Cc1c[nH]c2ccccc12)NC(=O)CN)C(C)O)C(N)=O
InChI Key InChIKey=XDVMOMDJVPMMLK-UHFFFAOYSA-N
Data  3 KI
  Tab Delimited (TSV)   2D SDfile   Computed 3D by Vconf -m prep SDfile
Find this compound or compounds like it in BindingDB:
Activity Spreadsheet -- Enzyme Inhibition Constant Data from BindingDB
Found 3 hits for monomerid = 85205
TargetGalanin receptor type 2(RAT)
Schering-Plough Research Institute
Curated by PDSP Ki Database
LigandPNGBDBM85205(Galanin (1-16) | Galanin (1-16), rat)
Affinity DataKi:  5.66nM
In DepthDetails ArticlePubMed
TargetGalanin receptor type 3(RAT)
Schering-Plough Research Institute
Curated by PDSP Ki Database
LigandPNGBDBM85205(Galanin (1-16) | Galanin (1-16), rat)
Affinity DataKi:  49.6nM
In DepthDetails ArticlePubMed
TargetGalanin receptor type 1(Homo sapiens (Human))
Dupont Pharmaceuticals
Curated by PDSP Ki Database
LigandPNGBDBM85205(Galanin (1-16) | Galanin (1-16), rat)
Affinity DataKi:  106nM
In DepthDetails PubMed