BDBM85257 (R)-N-Benzyl-3-benzamidoquinuclidinium bromide, 11::(S)-N-Benzyl-3-benzamidoquinuclidinium bromide, 12
SMILES O=C(NC1C[N+]2(Cc3ccccc3)CCC1CC2)c1ccccc1
InChI Key InChIKey=LCRRVNOWOVPFEZ-UHFFFAOYSA-O
Data  2 KI
  Tab Delimited (TSV)   2D SDfile   Computed 3D by Vconf -m prep SDfile
Find this compound or compounds like it in BindingDB:
Activity Spreadsheet -- Enzyme Inhibition Constant Data from BindingDB
Found 2 hits for monomerid = 85257
TargetCarboxylic ester hydrolase(Equus caballus (Horse))
University Of Zagreb
LigandPNGBDBM85257((R)-N-Benzyl-3-benzamidoquinuclidinium bromide, 11...)
Affinity DataKi:  3.70E+3nM ΔG°:  -7.78kcal/moleT: 2°C. Assay description: Butyrylcholinesterase type IV-S, lyophilized from horse serum (sigma Chemical Co.) was used without further purification. HPLC analyses (Thermo Sepa...
In DepthDetails ArticlePubMed
TargetCarboxylic ester hydrolase(Equus caballus (Horse))
University Of Zagreb
LigandPNGBDBM85257((R)-N-Benzyl-3-benzamidoquinuclidinium bromide, 11...)
Affinity DataKi:  2.59E+4nM ΔG°:  -6.57kcal/moleT: 2°C. Assay description: Butyrylcholinesterase type IV-S, lyophilized from horse serum (sigma Chemical Co.) was used without further purification. HPLC analyses (Thermo Sepa...
In DepthDetails ArticlePubMed