BDBM85519 L-797,591::L-797591
SMILES CC(CCN)CC(C)(C)CNC(=O)[C@@H](Cc1cccc2ccccc12)NC(=O)N(CCc1ccccc1)CCc1ccccn1
InChI Key InChIKey=MZKKCMXXGCRPGX-LMZJGDDPSA-N
Data  5 KI
  Tab Delimited (TSV)   2D SDfile   Computed 3D by Vconf -m prep SDfile
Find this compound or compounds like it in BindingDB:
Activity Spreadsheet -- Enzyme Inhibition Constant Data from BindingDB
Found 5 hits for monomerid = 85519
TargetSomatostatin receptor type 1(Homo sapiens (Human))
Royal Victoria Hospital
Curated by PDSP Ki Database
LigandPNGBDBM85519(L-797,591 | L-797591)
Affinity DataKi:  1.40nM
In DepthDetails ArticlePubMed
TargetSomatostatin receptor type 4(Homo sapiens (Human))
Royal Victoria Hospital
Curated by PDSP Ki Database
LigandPNGBDBM85519(L-797,591 | L-797591)
Affinity DataKi:  170nM
In DepthDetails ArticlePubMed
TargetSomatostatin receptor type 2(Homo sapiens (Human))
Royal Victoria Hospital
Curated by PDSP Ki Database
LigandPNGBDBM85519(L-797,591 | L-797591)
Affinity DataKi:  1.88E+3nM
In DepthDetails ArticlePubMed
TargetSomatostatin receptor type 3(Homo sapiens (Human))
Royal Victoria Hospital
Curated by PDSP Ki Database
LigandPNGBDBM85519(L-797,591 | L-797591)
Affinity DataKi:  2.24E+3nM
In DepthDetails ArticlePubMed
TargetSomatostatin receptor type 5(Homo sapiens (Human))
Royal Victoria Hospital
Curated by PDSP Ki Database
LigandPNGBDBM85519(L-797,591 | L-797591)
Affinity DataKi:  3.60E+3nM
In DepthDetails ArticlePubMed