BDBM85589 AANAT Inhibitor, 8g
SMILES BrCC(=O)NCCc1csc2ccc(Br)cc12
InChI Key InChIKey=QZPVBPCYNGCFCF-UHFFFAOYSA-N
Data  1 IC50
  Tab Delimited (TSV)   2D SDfile   Computed 3D by Vconf -m prep SDfile
Find this compound or compounds like it in BindingDB:
Activity Spreadsheet -- Enzyme Inhibition Constant Data from BindingDB
Found 1 hit for monomerid = 85589
TargetSerotonin N-acetyltransferase(Homo sapiens (Human))
UniversitÉ
LigandPNGBDBM85589(AANAT Inhibitor, 8g)
Affinity DataIC50:  3.78E+3nMpH: 6.8 T: 2°C. Assay description: The compounds were evaluated in a human serotonin N-acetyltransferase assay.
In DepthDetails ArticlePubMed