BDBM85935 TMPNMe
SMILES COC(=O)[C@@H]([C@@H]1CCCCN1C)c1ccccc1
InChI Key InChIKey=ZMWIDYCUFHNGLQ-UONOGXRCSA-N
Data  2 KI
  Tab Delimited (TSV)   2D SDfile   Computed 3D by Vconf -m prep SDfile
Find this compound or compounds like it in BindingDB:
Activity Spreadsheet -- Enzyme Inhibition Constant Data from BindingDB
Found 2 hits for monomerid = 85935
TargetSodium-dependent dopamine transporter(Rattus norvegicus (rat))
Mercer University
Curated by PDSP Ki Database
LigandPNGBDBM85935(TMPNMe)
Affinity DataKi:  499nM
In DepthDetails ArticlePubMed
TargetSodium-dependent serotonin transporter(Rattus norvegicus (rat))
Mercer University
Curated by PDSP Ki Database
LigandPNGBDBM85935(TMPNMe)
Affinity DataKi: >1.00E+4nM
In DepthDetails ArticlePubMed