BDBM85995 [leu13]pMOT(1-11)
SMILES CC[C@H](C)[C@H](NC(=O)[C@@H]1CCCN1C(=O)[C@@H](NC(=O)[C@@H](N)Cc1ccccc1)C(C)C)C(=O)N[C@@H](Cc1ccccc1)C(=O)N[C@@H]([C@@H](C)O)C(=O)N[C@@H](Cc1ccc(O)cc1)C(=O)NCC(=O)N[C@@H](CCC(O)=O)C(=O)N[C@@H](CC(C)C)C(=O)N[C@@H](CCC(N)=O)C(N)=O
InChI Key InChIKey=JNLDSKXXHDDHIP-XUPMJSFCSA-N
Data  1 KI
  Tab Delimited (TSV)   2D SDfile   Computed 3D by Vconf -m prep SDfile
Find this compound or compounds like it in BindingDB:
Activity Spreadsheet -- Enzyme Inhibition Constant Data from BindingDB
Found 1 hit for monomerid = 85995
TargetPromotilin(Homo sapiens (Human))
Katholieke Universiteit Leuven
Curated by PDSP Ki Database
LigandPNGBDBM85995([leu13]pMOT(1-11))
Affinity DataKi:  89.1nM
In DepthDetails ArticlePubMed