BDBM86008 Chalcone, 7
SMILES COc1cccc(\C=C\C(=O)c2ccccc2O)c1
InChI Key InChIKey=UKFWQYIIRNXCEQ-MDZDMXLPSA-N
Data  1 IC50
  Tab Delimited (TSV)   2D SDfile   Computed 3D by Vconf -m prep SDfile
Find this compound or compounds like it in BindingDB:
Activity Spreadsheet -- Enzyme Inhibition Constant Data from BindingDB
Found 1 hit for monomerid = 86008
TargetAcetylcholinesterase(Tetronarce californica (Pacific electric ray) (Tor...)
Quaid-I-Azam University
LigandPNGBDBM86008(Chalcone, 7)
Affinity DataIC50:  6.60E+4nMpH: 8.0 T: 2°C. Assay description: In vitro cholinesterase inhibition assay using electric-eel acetylcholinesterase, horse-serum butyrylcholinesterse. The IC50 values were calculated ...
In DepthDetails ArticlePubMed