BDBM86054 5'-IODORESINIFERATOXIN::I-RTX
SMILES COc1cc(CC(=O)OCC2=CC[C@H]3[C@@H](C=C(C)C3=O)[C@]34O[C@]5(Cc6ccccc6)O[C@H]([C@H]23)[C@](C[C@H]4C)(O5)C(C)=C)cc(I)c1O
InChI Key InChIKey=PRSOJYCWDJVGPH-GEOKYXHESA-N
Data  2 KI
  Tab Delimited (TSV)   2D SDfile   Computed 3D by Vconf -m prep SDfile
Find this compound or compounds like it in BindingDB:
Activity Spreadsheet -- Enzyme Inhibition Constant Data from BindingDB
Found 2 hits for monomerid = 86054
TargetTransient receptor potential cation channel subfamily V member 1(Rattus norvegicus (rat))
Merck Sharp And Dohme Research Laboratories
Curated by PDSP Ki Database
LigandPNGBDBM86054(5'-IODORESINIFERATOXIN | I-RTX)
Affinity DataKi:  0.390nM
In DepthDetails ArticlePubMed
TargetTransient receptor potential cation channel subfamily V member 1(Homo sapiens (Human))
Merck Sharp And Dohme Research Laboratories
Curated by PDSP Ki Database
LigandPNGBDBM86054(5'-IODORESINIFERATOXIN | I-RTX)
Affinity DataKi:  6.70nM
In DepthDetails ArticlePubMed