BDBM86077 Tetraketone, 11
SMILES CN(C)c1ccc(cc1)C(C1C(=O)CC(C)(C)CC1=O)C1C(=O)CC(C)(C)CC1=O
InChI Key InChIKey=JVPRHRIFERQAJU-UHFFFAOYSA-N
Data  1 IC50
  Tab Delimited (TSV)   2D SDfile   Computed 3D by Vconf -m prep SDfile
Find this compound or compounds like it in BindingDB:
Activity Spreadsheet -- Enzyme Inhibition Constant Data from BindingDB
Found 1 hit for monomerid = 86077
TargetArachidonate 12-lipoxygenase, 12R-type(Homo sapiens (Human))
Pharmaceutical Research Centre
LigandPNGBDBM86077(Tetraketone, 11)
Affinity DataIC50:  1.75E+4nMpH: 8.0 T: 2°C. Assay description: In vitro liposygenase inhibition assay activity was measured by modifying the spectrophotometric method developed by Tappel. The compound was prepar...
In DepthDetails ArticlePubMed