BDBM86172 2-(3-Chlorophenyl)histamine
SMILES NCCc1cnc([nH]1)-c1cccc(Cl)c1
InChI Key InChIKey=DHGUFKPZDMQBED-UHFFFAOYSA-N
Data  2 KI  1 IC50
  Tab Delimited (TSV)   2D SDfile   Computed 3D by Vconf -m prep SDfile
Find this compound or compounds like it in BindingDB:
Activity Spreadsheet -- Enzyme Inhibition Constant Data from BindingDB
Found 3 hits for monomerid = 86172
TargetHistamine H1 receptor(Cavia porcellus (domestic guinea pig))
University Of Kansas
Curated by PDSP Ki Database
LigandPNGBDBM86172(2-(3-Chlorophenyl)histamine)
Affinity DataKi:  600nM
In DepthDetails ArticlePubMed
TargetHistamine H1 receptor(Homo sapiens (Human))
University Of Kansas
Curated by PDSP Ki Database
LigandPNGBDBM86172(2-(3-Chlorophenyl)histamine)
Affinity DataKi:  1.78E+3nM
In DepthDetails ArticlePubMed
TargetHistamine H1 receptor(Homo sapiens (Human))
University Of Kansas
Curated by PDSP Ki Database
LigandPNGBDBM86172(2-(3-Chlorophenyl)histamine)
Affinity DataIC50:  2.00E+3nM. Assay description: Inhibitory activity against human Histamine H1 receptor
In DepthDetails ArticlePubMed