BDBM86262 HS-378::HS378
SMILES CCO[C@]12Cc3c([nH]c4ccccc34)[C@]3(C)Oc4c5c(CC1N(CC1CC1)CC[C@@]235)ccc4O
InChI Key InChIKey=OMUSJJBIQWMCAN-PCYNRASCSA-N
Data  4 KI
  Tab Delimited (TSV)   2D SDfile   Computed 3D by Vconf -m prep SDfile
Find this compound or compounds like it in BindingDB:
Activity Spreadsheet -- Enzyme Inhibition Constant Data from BindingDB
Found 4 hits for monomerid = 86262
TargetDelta-type opioid receptor(Rattus norvegicus (rat))
University Of Innsbruck
Curated by PDSP Ki Database
LigandPNGBDBM86262(HS-378 | HS378)
Affinity DataKi:  0.780nM
In DepthDetails ArticlePubMed
TargetKappa-type opioid receptor(Rattus norvegicus (rat))
University Of Innsbruck
Curated by PDSP Ki Database
LigandPNGBDBM86262(HS-378 | HS378)
Affinity DataKi:  134nM
In DepthDetails ArticlePubMed
TargetMu-type opioid receptor(Rattus norvegicus (rat))
University Of Innsbruck
Curated by PDSP Ki Database
LigandPNGBDBM86262(HS-378 | HS378)
Affinity DataKi:  340nM
In DepthDetails ArticlePubMed
TargetDelta-type opioid receptor(Rattus norvegicus (rat))
University Of Innsbruck
Curated by PDSP Ki Database
LigandPNGBDBM86262(HS-378 | HS378)
Affinity DataKi:  528nM
In DepthDetails ArticlePubMed