BDBM86281 MCL-213
SMILES Cc1ccc(cc1)C1CN(CC=C)CCc2c(Br)c(O)c(O)cc12
InChI Key InChIKey=MOEBYVAWAFLVIS-UHFFFAOYSA-N
Data  5 KI
  Tab Delimited (TSV)   2D SDfile   Computed 3D by Vconf -m prep SDfile
Find this compound or compounds like it in BindingDB:
Activity Spreadsheet -- Enzyme Inhibition Constant Data from BindingDB
Found 5 hits for monomerid = 86281
TargetD(1A) dopamine receptor(RAT)
Harvard University
Curated by PDSP Ki Database
LigandPNGBDBM86281(MCL-213)
Affinity DataKi:  128nM
In DepthDetails ArticlePubMed
TargetD(3) dopamine receptor(Homo sapiens (Human))
Harvard University
Curated by PDSP Ki Database
LigandPNGBDBM86281(MCL-213)
Affinity DataKi:  385nM
In DepthDetails ArticlePubMed
Target5-hydroxytryptamine receptor 2A(Rattus norvegicus (rat))
Harvard University
Curated by PDSP Ki Database
LigandPNGBDBM86281(MCL-213)
Affinity DataKi:  977nM
In DepthDetails ArticlePubMed
TargetAlpha-2C adrenergic receptor(RAT)
Harvard University
Curated by PDSP Ki Database
LigandPNGBDBM86281(MCL-213)
Affinity DataKi:  1.09E+3nM
In DepthDetails ArticlePubMed
TargetD(2) dopamine receptor(Rattus norvegicus (rat))
Harvard University
Curated by PDSP Ki Database
LigandPNGBDBM86281(MCL-213)
Affinity DataKi:  1.71E+3nM
In DepthDetails ArticlePubMed