BDBM86372 Juniferdin derivative, 3
SMILES CC(=O)O[C@@H]1\C=C(C)\C(C\C=C(C)\CCCC1(C)C)OC(=O)c1ccc(O)cc1
InChI Key InChIKey=YUURXLYREVDXOP-JCDVWMPLSA-N
Data  1 IC50
  Tab Delimited (TSV)   2D SDfile   Computed 3D by Vconf -m prep SDfile
Find this compound or compounds like it in BindingDB:
Activity Spreadsheet -- Enzyme Inhibition Constant Data from BindingDB
Found 1 hit for monomerid = 86372
TargetProtein disulfide-isomerase(Homo sapiens (Human))
Riken Advanced Science Institute
LigandPNGBDBM86372(Juniferdin derivative, 3)
Affinity DataIC50:  453nMpH: 7.0Assay Description:Reductase activity was assayed by measuring the PDI-catalyzed reduction of insulin in the presence of DTT, thus measuring the aggregation of reduced ...
In DepthDetails ArticlePubMed