BDBM86380 Juniferdin derivative, 10
SMILES Oc1ccc(cc1)C(=O)OC1CCCCCCCCCCC1
InChI Key InChIKey=VRYZOKFCEDNHPP-UHFFFAOYSA-N
Data  1 IC50
  Tab Delimited (TSV)   2D SDfile   Computed 3D by Vconf -m prep SDfile
Find this compound or compounds like it in BindingDB:
Activity Spreadsheet -- Enzyme Inhibition Constant Data from BindingDB
Found 1 hit for monomerid = 86380
TargetProtein disulfide-isomerase(Homo sapiens (Human))
Riken Advanced Science Institute
LigandPNGBDBM86380(Juniferdin derivative, 10)
Affinity DataIC50:  565nMpH: 7.0Assay Description:Reductase activity was assayed by measuring the PDI-catalyzed reduction of insulin in the presence of DTT, thus measuring the aggregation of reduced ...
In DepthDetails ArticlePubMed