BDBM86385 Juniferdin derivative, 17
SMILES C\C1=C/[C@@H](O)C(C)(C)CCC[C@](C)(O)[C@@H](O)CC1OC(=O)c1ccc(O)cc1
InChI Key InChIKey=PTXVSFQAEBBMCK-KDGDEWHISA-N
Data  1 IC50
  Tab Delimited (TSV)   2D SDfile   Computed 3D by Vconf -m prep SDfile
Find this compound or compounds like it in BindingDB:
Activity Spreadsheet -- Enzyme Inhibition Constant Data from BindingDB
Found 1 hit for monomerid = 86385
TargetProtein disulfide-isomerase(Homo sapiens (Human))
Riken Advanced Science Institute
LigandPNGBDBM86385(Juniferdin derivative, 17)
Affinity DataIC50:  1.85E+3nMpH: 7.0Assay Description:Reductase activity was assayed by measuring the PDI-catalyzed reduction of insulin in the presence of DTT, thus measuring the aggregation of reduced ...
In DepthDetails ArticlePubMed