BDBM86451 1-(2-ETHYLPHENOXY)-3-[[(1S)-1,2,3,4-TETRAHYDRO-1-NAPHTHALENYL]AMINO]-(2S)-2-PROPANOL::CAS_174689-39-5::SR 59230A
SMILES CCc1ccccc1OC[C@@H](O)CN[C@H]1CCCc2ccccc12
InChI Key InChIKey=VFDHMSXXELYMRW-ICSRJNTNSA-N
Data  3 KI
  Tab Delimited (TSV)   2D SDfile   Computed 3D by Vconf -m prep SDfile
Find this compound or compounds like it in BindingDB:
Activity Spreadsheet -- Enzyme Inhibition Constant Data from BindingDB
Found 3 hits for monomerid = 86451
TargetBeta-1 adrenergic receptor(Homo sapiens (Human))
UniversitÄT WÜRzburg
Curated by PDSP Ki Database
LigandPNGBDBM86451(1-(2-ETHYLPHENOXY)-3-[[(1S)-1,2,3,4-TETRAHYDRO-1-N...)
Affinity DataKi:  16.4nM
In DepthDetails ArticlePubMed
TargetBeta-2 adrenergic receptor(Homo sapiens (Human))
UniversitÄT WÜRzburg
Curated by PDSP Ki Database
LigandPNGBDBM86451(1-(2-ETHYLPHENOXY)-3-[[(1S)-1,2,3,4-TETRAHYDRO-1-N...)
Affinity DataKi:  61.9nM
In DepthDetails ArticlePubMed
TargetBeta-3 adrenergic receptor(Homo sapiens (Human))
UniversitÄT WÜRzburg
Curated by PDSP Ki Database
LigandPNGBDBM86451(1-(2-ETHYLPHENOXY)-3-[[(1S)-1,2,3,4-TETRAHYDRO-1-N...)
Affinity DataKi:  122nM
In DepthDetails ArticlePubMed