BDBM86520 6-AcDHM
SMILES CN1CCC23C4Oc5c2c(CC1C3CCC4OC(C)=O)ccc5O
InChI Key InChIKey=QSMMSROGHQAUSB-UHFFFAOYSA-N
Data  4 KI
  Tab Delimited (TSV)   2D SDfile   Computed 3D by Vconf -m prep SDfile
Find this compound or compounds like it in BindingDB:
Activity Spreadsheet -- Enzyme Inhibition Constant Data from BindingDB
Found 4 hits for monomerid = 86520
TargetMu-type opioid receptor(CALF)
Memorial Sloan-Kettering Cancer Center
Curated by PDSP Ki Database
LigandPNGBDBM86520(6-AcDHM)
Affinity DataKi:  1.83nM
In DepthDetails ArticlePubMed
TargetMu-type opioid receptor(CALF)
Memorial Sloan-Kettering Cancer Center
Curated by PDSP Ki Database
LigandPNGBDBM86520(6-AcDHM)
Affinity DataKi:  12.3nM
In DepthDetails ArticlePubMed
TargetKappa-type opioid receptor(CALF)
Memorial Sloan-Kettering Cancer Center
Curated by PDSP Ki Database
LigandPNGBDBM86520(6-AcDHM)
Affinity DataKi:  148nM
In DepthDetails ArticlePubMed
TargetKappa-type opioid receptor(Cavia porcellus (domestic guinea pig))
Memorial Sloan-Kettering Cancer Center
Curated by PDSP Ki Database
LigandPNGBDBM86520(6-AcDHM)
Affinity DataKi:  731nM
In DepthDetails ArticlePubMed