BDBM86665 HS531
SMILES CO[C@]12Cc3c(C4Oc5c6c(CC1N(CC=C)CCC246)ccc5O)n(C)c1ccccc31
InChI Key InChIKey=GGPUEQWICZXJLV-PACKQSAWSA-N
Data  1 KI
  Tab Delimited (TSV)   2D SDfile   Computed 3D by Vconf -m prep SDfile
Find this compound or compounds like it in BindingDB:
Activity Spreadsheet -- Enzyme Inhibition Constant Data from BindingDB
Found 1 hit for monomerid = 86665
TargetDelta-type opioid receptor(Homo sapiens (Human))
I.G.B.M.C.
Curated by PDSP Ki Database
LigandPNGBDBM86665(HS531)
Affinity DataKi:  0.420nM
In DepthDetails ArticlePubMed