BDBM86749 LY 457691
SMILES OC(=O)[C@@H]1C[C@H]2C[C@H](CC[C@H]2CN1)Nc1ccccc1-c1nnn[nH]1
InChI Key InChIKey=SPIBJDVGRFDGQS-OXIQGZBJSA-N
Data  2 KI
  Tab Delimited (TSV)   2D SDfile   Computed 3D by Vconf -m prep SDfile
Find this compound or compounds like it in BindingDB:
Activity Spreadsheet -- Enzyme Inhibition Constant Data from BindingDB
Found 2 hits for monomerid = 86749
TargetGlutamate receptor ionotropic, kainate 5(Homo sapiens (Human))
Eli Lilly
Curated by PDSP Ki Database
LigandPNGBDBM86749(LY 457691)
Affinity DataKi:  1.55E+3nM
In DepthDetails ArticlePubMed
TargetGlutamate receptor 2(Homo sapiens (Human))
Eli Lilly
Curated by PDSP Ki Database
LigandPNGBDBM86749(LY 457691)
Affinity DataKi:  5.50E+3nM
In DepthDetails ArticlePubMed