BDBM86769 Nicotinamide hydrochloride analog, 6b
SMILES NNc1ccc(cn1)C(=O)NCCCCCNc1c2CCCCc2nc2ccccc12
InChI Key InChIKey=OGHOWRIMPXHKCE-UHFFFAOYSA-N
Data  2 IC50
  Tab Delimited (TSV)   2D SDfile   Computed 3D by Vconf -m prep SDfile
Find this compound or compounds like it in BindingDB:
Activity Spreadsheet -- Enzyme Inhibition Constant Data from BindingDB
Found 2 hits for monomerid = 86769
TargetCarboxylic ester hydrolase(Equus caballus (Horse))
Medical University Of Lodz
LigandPNGBDBM86769(Nicotinamide hydrochloride analog, 6b)
Affinity DataIC50:  0.645nM. Assay description: Enzyme activity using acetylcholinesterase (AChE) and butyrylcholinesterase (BChE).
In DepthDetails ArticlePubMed
TargetAcetylcholinesterase(Electrophorus electricus (Electric eel))
Medical University Of Lodz
LigandPNGBDBM86769(Nicotinamide hydrochloride analog, 6b)
Affinity DataIC50:  308nM. Assay description: Enzyme activity using acetylcholinesterase (AChE) and butyrylcholinesterase (BChE).
In DepthDetails ArticlePubMed