BDBM86857 CAS_44454939::N-(5-(4-nitrobenzylthio)-1,3,4-thiadiazol-2-yl)-2-chlorobenzamide::NSC_44454939
SMILES [O-][N+](=O)c1ccc(CSc2nnc(NC(=O)c3ccccc3Cl)s2)cc1
InChI Key InChIKey=AACFRJDPYQPXPD-UHFFFAOYSA-N
Data  2 KI
  Tab Delimited (TSV)   2D SDfile   Computed 3D by Vconf -m prep SDfile
Find this compound or compounds like it in BindingDB:
Activity Spreadsheet -- Enzyme Inhibition Constant Data from BindingDB
Found 2 hits for monomerid = 86857
TargetTyrosine-protein kinase ABL1(Homo sapiens (Human))
Universit&Aagrov
Curated by PDSP Ki Database
LigandPNGBDBM86857(CAS_44454939 | N-(5-(4-nitrobenzylthio)-1,3,4-thia...)
Affinity DataKi:  83nM
In DepthDetails ArticlePubMed
TargetProto-oncogene tyrosine-protein kinase Src(Homo sapiens (Human))
Universit&Aagrov
Curated by PDSP Ki Database
LigandPNGBDBM86857(CAS_44454939 | N-(5-(4-nitrobenzylthio)-1,3,4-thia...)
Affinity DataKi:  219nM
In DepthDetails ArticlePubMed