BDBM86858 CAS_2192320::N-(5-(3-fluorobenzylthio)-1,3,4-thiadiazol-2-yl)-2-chlorobenzamide::NSC_2192320
SMILES Fc1cccc(CSc2nnc(NC(=O)c3ccccc3Cl)s2)c1
InChI Key InChIKey=ORNALFBTQOYCMM-UHFFFAOYSA-N
Data  2 KI
  Tab Delimited (TSV)   2D SDfile   Computed 3D by Vconf -m prep SDfile
Find this compound or compounds like it in BindingDB:
Activity Spreadsheet -- Enzyme Inhibition Constant Data from BindingDB
Found 2 hits for monomerid = 86858
TargetTyrosine-protein kinase ABL1(Homo sapiens (Human))
Universit&Aagrov
Curated by PDSP Ki Database
LigandPNGBDBM86858(CAS_2192320 | N-(5-(3-fluorobenzylthio)-1,3,4-thia...)
Affinity DataKi:  272nM
In DepthDetails ArticlePubMed
TargetProto-oncogene tyrosine-protein kinase Src(Homo sapiens (Human))
Universit&Aagrov
Curated by PDSP Ki Database
LigandPNGBDBM86858(CAS_2192320 | N-(5-(3-fluorobenzylthio)-1,3,4-thia...)
Affinity DataKi:  718nM
In DepthDetails ArticlePubMed