BDBM86861 CAS_2363161::N-(5-(4-fluorobenzylthio)-1,3,4-thiadiazol-2-yl)-2-chlorobenzamide::NSC_2363161
SMILES Fc1ccc(CSc2nnc(NC(=O)c3ccccc3Cl)s2)cc1
InChI Key InChIKey=WXXFWDYVXQHEJU-UHFFFAOYSA-N
Data  2 KI
  Tab Delimited (TSV)   2D SDfile   Computed 3D by Vconf -m prep SDfile
Find this compound or compounds like it in BindingDB:
Activity Spreadsheet -- Enzyme Inhibition Constant Data from BindingDB
Found 2 hits for monomerid = 86861
TargetTyrosine-protein kinase ABL1(Homo sapiens (Human))
Universit&Aagrov
Curated by PDSP Ki Database
LigandPNGBDBM86861(CAS_2363161 | N-(5-(4-fluorobenzylthio)-1,3,4-thia...)
Affinity DataKi:  406nM
In DepthDetails ArticlePubMed
TargetProto-oncogene tyrosine-protein kinase Src(Homo sapiens (Human))
Universit&Aagrov
Curated by PDSP Ki Database
LigandPNGBDBM86861(CAS_2363161 | N-(5-(4-fluorobenzylthio)-1,3,4-thia...)
Affinity DataKi:  900nM
In DepthDetails ArticlePubMed