BDBM87040 (S)-2-((S)-(2-methoxy-4-(trifluoromethyl)phenoxy)(phenyl)methyl)morpholine::CAS_44450120::NSC_44450120
SMILES COc1cc(ccc1OC(C1CNCCO1)c1ccccc1)C(F)(F)F
InChI Key InChIKey=OULZYJCJGXXRLZ-UHFFFAOYSA-N
Data  2 KI
  Tab Delimited (TSV)   2D SDfile   Computed 3D by Vconf -m prep SDfile
Find this compound or compounds like it in BindingDB:
Activity Spreadsheet -- Enzyme Inhibition Constant Data from BindingDB
Found 2 hits for monomerid = 87040
TargetSodium-dependent serotonin transporter(Homo sapiens (Human))
Pfizer
Curated by PDSP Ki Database
LigandPNGBDBM87040((S)-2-((S)-(2-methoxy-4-(trifluoromethyl)phenoxy)(...)
Affinity DataKi:  41nM
In DepthDetails ArticlePubMed
TargetSodium-dependent noradrenaline transporter(Homo sapiens (Human))
Pfizer
Curated by PDSP Ki Database
LigandPNGBDBM87040((S)-2-((S)-(2-methoxy-4-(trifluoromethyl)phenoxy)(...)
Affinity DataKi:  160nM
In DepthDetails ArticlePubMed