BDBM87061 Sulfonamide derivative, 1
SMILES CC(CCC(=O)Nc1nnc(s1)S(N)(=O)=O)C1CCC2C3CCC4CC(O)CCC4(C)C3CCC12C
InChI Key InChIKey=WJNHCFDXIVVDDH-UHFFFAOYSA-N
Data  1 KI  1 IC50
  Tab Delimited (TSV)   2D SDfile   Computed 3D by Vconf -m prep SDfile
Find this compound or compounds like it in BindingDB:
Activity Spreadsheet -- Enzyme Inhibition Constant Data from BindingDB
Found 1 hit for monomerid = 87061
TargetGlutathione-disulfide reductase(Escherichia coli)
Dumlupinar University
LigandPNGBDBM87061(Sulfonamide derivative, 1)
Affinity DataKi:  7.23E+4nM IC50:  4.71E+4nM. Assay description: The enzyme activities in the absence of drugs or chemicals were taken as 100%. For each drug or chemical, an activity%-(drug) graph was drawn and dr...
In DepthDetails ArticlePubMed