BDBM873 (3R)-oxolan-3-yl N-[(1S,2S)-1-[(13R,16R)-12,15-dioxo-13-(propan-2-yl)-2,5,8-trioxa-11,14,17-triazabicyclo[17.2.2]tricosa-1(21),19,22-trien-16-yl]-1-hydroxy-3-phenylpropan-2-yl]carbamate::1OH-2(Cbz-Tle)3PhPr [14]paracyclophane deriv. 34
SMILES CC(C)C1NC(=O)[C@H](NCc2ccc(OCCOCCOCCNC1=O)cc2)C(O)[C@H](Cc1ccccc1)NC(=O)OC1CCOC1
InChI Key InChIKey=PWEJSYALDYQGFY-UFSCFTEJSA-N
Data  1 KI
  Tab Delimited (TSV)   2D SDfile   Computed 3D by Vconf -m prep SDfile
Find this compound or compounds like it in BindingDB:
Activity Spreadsheet -- Enzyme Inhibition Constant Data from BindingDB
Found 1 hit for monomerid = 873
TargetDimer of Gag-Pol polyprotein [489-587](Human immunodeficiency virus type 1)
Sandoz Research Institute
LigandPNGBDBM873((3R)-oxolan-3-yl N-[(1S,2S)-1-[(13R,16R)-12,15-dio...)
Affinity DataKi:  13.8nM ΔG°:  -11.1kcal/molepH: 6.25 T: 2°C. Assay description: Enzymatic activity was measured by following cleavage of the substrate H-Lys-Ala-Arg-Val-Leu-pNph-Glu-Ala-Nle-NH2. Products of the cleavage reaction ...
In DepthDetails ArticlePubMed