BDBM87478 4-[(5,5-diketo-3a,4,6,6a-tetrahydrothieno[3,4-d]thiazol-2-yl)amino]-N-homoveratryl-benzamide::4-[[5,5-bis(oxidanylidene)-3a,4,6,6a-tetrahydrothieno[3,4-d][1,3]thiazol-2-yl]amino]-N-[2-(3,4-dimethoxyphenyl)ethyl]benzamide::MLS001028445::N-[2-(3,4-dimethoxyphenyl)ethyl]-4-[(5,5-dioxo-3a,4,6,6a-tetrahydrothieno[3,4-d][1,3]thiazol-2-yl)amino]benzamide::N-[2-(3,4-dimethoxyphenyl)ethyl]-4-[(5,5-dioxo-3a,4,6,6a-tetrahydrothieno[3,4-d]thiazol-2-yl)amino]benzamide::SMR000634169::cid_5163066
SMILES COc1ccc(CCNC(=O)c2ccc(NC3=NC4CS(=O)(=O)CC4S3)cc2)cc1OC
InChI Key InChIKey=GCRAPGVMIIQFDZ-UHFFFAOYSA-N
Data  1 IC50
  Tab Delimited (TSV)   2D SDfile   Computed 3D by Vconf -m prep SDfile
Find this compound or compounds like it in BindingDB:
Activity Spreadsheet -- Enzyme Inhibition Constant Data from BindingDB
Found 1 hit for monomerid = 87478
TargetTyrosine-protein kinase ABL1(Homo sapiens (Human))
The Scripps Research Institute Molecular Screening Center
Curated by PubChem BioAssay
LigandPNGBDBM87478(4-[(5,5-diketo-3a,4,6,6a-tetrahydrothieno[3,4-d]th...)
Affinity DataIC50:  2.63E+4nM. Assay description: Source (MLPCN Center Name): The Scripps Research Institute Molecular Screening Center (SRIMSC) Affiliation: The Scripps Research Institute, TSRI Assa...
In DepthDetails PCBioAssay