BDBM88317 US9695118, 223::US9695118, 229
SMILES CCS(=O)(=O)c1ccc(Cl)cc1CNC(=O)c1cc(Br)c(CN2CC[C@@H](CNC)C2)c(c1)C(F)(F)F
InChI Key InChIKey=MXEVBRAZYBMHMT-HNNXBMFYSA-N
Data  2 IC50
  Tab Delimited (TSV)   2D SDfile   Computed 3D by Vconf -m prep SDfile
Find this compound or compounds like it in BindingDB:
Activity Spreadsheet -- Enzyme Inhibition Constant Data from BindingDB
Found 2 hits for monomerid = 88317
TargetEpithelial discoidin domain-containing receptor 1(Homo sapiens (Human))
Chugai Seiyaku Kabushiki Kaisha
US Patent
LigandPNGBDBM88317(US9695118, 223 | US9695118, 229)
Affinity DataIC50:  10nMT: 2°C. Assay description: DDR1 binding activity was measured by the LanthaScreen (Registered trademark) Eu Kinase Binding Assay (manufactured by Life Technologies Corporation)...
In DepthDetails US Patent
TargetEpithelial discoidin domain-containing receptor 1(Homo sapiens (Human))
Chugai Seiyaku Kabushiki Kaisha
US Patent
LigandPNGBDBM88317(US9695118, 223 | US9695118, 229)
Affinity DataIC50:  23nMT: 2°C. Assay description: DDR1 binding activity was measured by the LanthaScreen (Registered trademark) Eu Kinase Binding Assay (manufactured by Life Technologies Corporation)...
In DepthDetails US Patent