BDBM8833 3-(4-{4-amino-6-methylthieno[2,3-d]pyrimidin-5-yl}phenyl)-1-(4-methoxyphenyl)urea::N-[4-(4-Amino-6-methylthieno[2,3-d]pyrimidin-5-yl)-phenyl]-N -(4-methoxyphenyl)urea::Thienopyrimidine deriv. 15
SMILES COc1ccc(NC(=O)Nc2ccc(cc2)-c2c(C)sc3ncnc(N)c23)cc1
InChI Key InChIKey=ZPSQSBRNPLBDHP-UHFFFAOYSA-N
Data  7 IC50
  Tab Delimited (TSV)   2D SDfile   Computed 3D by Vconf -m prep SDfile
Find this compound or compounds like it in BindingDB:
Activity Spreadsheet -- Enzyme Inhibition Constant Data from BindingDB
Found 7 hits for monomerid = 8833
TargetVascular endothelial growth factor receptor 2(Homo sapiens (Human))
Abbott Laboratories
LigandPNGBDBM8833(3-(4-{4-amino-6-methylthieno[2,3-d]pyrimidin-5-yl}...)
Affinity DataIC50:  69nM. Assay description: The assay uses purified enzyme interacting with biotinylated peptide substrate. HTRF is based on the proximity of europium cryptate (donor fluorophor...
In DepthDetails ArticlePubMed
TargetMast/stem cell growth factor receptor Kit(Homo sapiens (Human))
Abbott Laboratories
LigandPNGBDBM8833(3-(4-{4-amino-6-methylthieno[2,3-d]pyrimidin-5-yl}...)
Affinity DataIC50:  15nM. Assay description: The assay uses purified enzyme interacting with biotinylated peptide substrate. HTRF is based on the proximity of europium cryptate (donor fluorophor...
In DepthDetails ArticlePubMed
TargetAngiopoietin-1 receptor(Homo sapiens (Human))
Abbott Laboratories
LigandPNGBDBM8833(3-(4-{4-amino-6-methylthieno[2,3-d]pyrimidin-5-yl}...)
Affinity DataIC50:  1.60E+3nM. Assay description: The assay uses purified enzyme interacting with biotinylated peptide substrate. HTRF is based on the proximity of europium cryptate (donor fluorophor...
In DepthDetails ArticlePubMed
TargetMast/stem cell growth factor receptor Kit(Homo sapiens (Human))
Abbott Laboratories
LigandPNGBDBM8833(3-(4-{4-amino-6-methylthieno[2,3-d]pyrimidin-5-yl}...)
Affinity DataIC50:  15.1nM. Assay description: Inhibition of cKIT
In DepthDetails ArticlePubMed
TargetAngiopoietin-1 receptor(Homo sapiens (Human))
Abbott Laboratories
LigandPNGBDBM8833(3-(4-{4-amino-6-methylthieno[2,3-d]pyrimidin-5-yl}...)
Affinity DataIC50:  1.58E+3nM. Assay description: Inhibition of Tie2
In DepthDetails ArticlePubMed
TargetVascular endothelial growth factor receptor 2(Homo sapiens (Human))
Abbott Laboratories
LigandPNGBDBM8833(3-(4-{4-amino-6-methylthieno[2,3-d]pyrimidin-5-yl}...)
Affinity DataIC50:  69.2nM. Assay description: Inhibition of KDR
In DepthDetails ArticlePubMed
TargetMast/stem cell growth factor receptor Kit(Homo sapiens (Human))
Abbott Laboratories
LigandPNGBDBM8833(3-(4-{4-amino-6-methylthieno[2,3-d]pyrimidin-5-yl}...)
Affinity DataIC50:  15nM. Assay description: Inhibition of c-Kit by HTRF method
In DepthDetails ArticlePubMed