BDBM88710 MLS003314990::SMR001994656::cid_51360688
SMILES [H]C12CCC([H])(C1)c1c2cc(-c2ccc(F)nc2)c2ccn(C)c12
InChI Key InChIKey=BJOVXTDNNPXWEA-UHFFFAOYSA-N
Data  3 EC50
  Tab Delimited (TSV)   2D SDfile   Computed 3D by Vconf -m prep SDfile
Find this compound or compounds like it in BindingDB:
Activity Spreadsheet -- Enzyme Inhibition Constant Data from BindingDB
Found 3 hits for monomerid = 88710
TargetLethal factor(Bacillus anthracis)
Nmmlsc
Curated by PubChem BioAssay
LigandPNGBDBM88710(MLS003314990 | SMR001994656 | cid_51360688)
Affinity DataEC50:  1.06E+4nM. Assay description: University of New Mexico Assay Overview: Assay Support: 1 R03 MH093184-01A1 Project Title: High-throughput multiplex microsphere screening for tox...
Ligand InfoPC cidPC sid
In DepthDetails PCBioAssay
TargetBotulinum neurotoxin type F(Clostridium botulinum Bf)
Nmmlsc
Curated by PubChem BioAssay
LigandPNGBDBM88710(MLS003314990 | SMR001994656 | cid_51360688)
Affinity DataEC50: >2.00E+4nM. Assay description: University of New Mexico Assay Overview: Assay Support: 1 R03 MH093184-01A1 Project Title: High-throughput multiplex microsphere screening for tox...
Ligand InfoPC cidPC sid
In DepthDetails PCBioAssay
TargetBotulinum neurotoxin type A(Clostridium botulinum (strain Hall / ATCC 3502 / N...)
Nmmlsc
Curated by PubChem BioAssay
LigandPNGBDBM88710(MLS003314990 | SMR001994656 | cid_51360688)
Affinity DataEC50: >2.00E+4nM. Assay description: University of New Mexico Assay Overview: Assay Support: 1 R03 MH093184-01A1 Project Title: High-throughput multiplex microsphere screening for tox...
Ligand InfoPC cidPC sid
In DepthDetails PCBioAssay