BDBM88824 2-[(5-methylisoxazole-3-carbonyl)amino]-4-(3-pyridyl)thiophene-3-carboxylic acid methyl ester::2-[[(5-methyl-3-isoxazolyl)-oxomethyl]amino]-4-(3-pyridinyl)-3-thiophenecarboxylic acid methyl ester::MLS000051759::SMR000080708::cid_1247094::methyl 2-[(5-methyl-1,2-oxazol-3-yl)carbonylamino]-4-pyridin-3-yl-thiophene-3-carboxylate::methyl 2-[(5-methyl-1,2-oxazole-3-carbonyl)amino]-4-pyridin-3-ylthiophene-3-carboxylate::methyl 2-{[(5-methyl-3-isoxazolyl)carbonyl]amino}-4-(3-pyridinyl)-3-thiophenecarboxylate
SMILES COC(=O)c1c(NC(=O)c2cc(C)on2)scc1-c1cccnc1
InChI Key InChIKey=VLWIVWDZEUGVSF-UHFFFAOYSA-N
Data  2 IC50
  Tab Delimited (TSV)   2D SDfile   Computed 3D by Vconf -m prep SDfile
Find this compound or compounds like it in BindingDB:
Activity Spreadsheet -- Enzyme Inhibition Constant Data from BindingDB
Found 2 hits for monomerid = 88824
TargetProthrombin(Bos taurus (Bovine))
Burnham Center For Chemical Genomics
Curated by PubChem BioAssay
LigandPNGBDBM88824(2-[(5-methylisoxazole-3-carbonyl)amino]-4-(3-pyrid...)
Affinity DataIC50:  4.83E+4nM. Assay description: Data Source: Sanford-Burnham Center for Chemical Genomics (SBCCG) Source Affiliation: Sanford Burnham Medical Research Institute (SBMRI, La Jolla, CA...
In DepthDetails PCBioAssay
Target26S proteasome non-ATPase regulatory subunit 14(Homo sapiens (Human))
Burnham Center For Chemical Genomics
Curated by PubChem BioAssay
LigandPNGBDBM88824(2-[(5-methylisoxazole-3-carbonyl)amino]-4-(3-pyrid...)
Affinity DataIC50:  2.96E+4nM. Assay description: Data Source: Sanford-Burnham Center for Chemical Genomics (SBCCG) Source Affiliation: Sanford Burnham Medical Research Institute (SBMRI, La Jolla, CA...
In DepthDetails PCBioAssay