BDBM88866 (5E)-1-(4-methoxybenzoyl)-5-[(4-methylphenyl)methylidene]-2-sulfanylideneimidazolidin-4-one::(5E)-1-(4-methoxyphenyl)carbonyl-5-[(4-methylphenyl)methylidene]-2-sulfanylidene-imidazolidin-4-one::(5E)-1-[(4-methoxyphenyl)-oxomethyl]-5-[(4-methylphenyl)methylidene]-2-sulfanylidene-4-imidazolidinone::(5E)-5-(4-methylbenzylidene)-1-p-anisoyl-2-thioxo-4-imidazolidinone::1-(4-Methoxy-benzoyl)-5-(4-methyl-benzylidene)-2-thioxo-imidazolidin-4-one::MLS000569478::SMR000175709::cid_1151133
SMILES COc1ccc(cc1)C(=O)N1C(=S)NC(=O)\C1=C/c1ccc(C)cc1
InChI Key InChIKey=LUNULWSLLIDRKH-LFIBNONCSA-N
Data  2 IC50
  Tab Delimited (TSV)   2D SDfile   Computed 3D by Vconf -m prep SDfile
Find this compound or compounds like it in BindingDB:
Activity Spreadsheet -- Enzyme Inhibition Constant Data from BindingDB
Found 2 hits for monomerid = 88866
Target26S proteasome non-ATPase regulatory subunit 14(Homo sapiens (Human))
Burnham Center For Chemical Genomics
Curated by PubChem BioAssay
LigandPNGBDBM88866((5E)-1-(4-methoxybenzoyl)-5-[(4-methylphenyl)methy...)
Affinity DataIC50:  2.25E+4nM. Assay description: Data Source: Sanford-Burnham Center for Chemical Genomics (SBCCG) Source Affiliation: Sanford Burnham Medical Research Institute (SBMRI, La Jolla, CA...
In DepthDetails PCBioAssay
TargetProthrombin(Bos taurus (Bovine))
Burnham Center For Chemical Genomics
Curated by PubChem BioAssay
LigandPNGBDBM88866((5E)-1-(4-methoxybenzoyl)-5-[(4-methylphenyl)methy...)
Affinity DataIC50:  3.78E+4nM. Assay description: Data Source: Sanford-Burnham Center for Chemical Genomics (SBCCG) Source Affiliation: Sanford Burnham Medical Research Institute (SBMRI, La Jolla, CA...
In DepthDetails PCBioAssay