BDBM89461 3-methoxy-4-[[5-methyl-6-oxidanylidene-9-(phenylmethyl)-7,8-dihydropyrimido[4,5-b][1,4]diazepin-2-yl]amino]-N-(1-methylpiperidin-4-yl)benzamide::3-methoxy-4-[[5-methyl-6-oxo-9-(phenylmethyl)-7,8-dihydropyrimido[4,5-b][1,4]diazepin-2-yl]amino]-N-(1-methyl-4-piperidinyl)benzamide::4-[(9-benzyl-5-methyl-6-oxo-7,8-dihydropyrimido[4,5-b][1,4]diazepin-2-yl)amino]-3-methoxy-N-(1-methylpiperidin-4-yl)benzamide::4-[(9-benzyl-6-keto-5-methyl-7,8-dihydropyrimido[4,5-b][1,4]diazepin-2-yl)amino]-3-methoxy-N-(1-methyl-4-piperidyl)benzamide::MLS002232306::SMR001307860::cid_42610360
SMILES COc1cc(ccc1Nc1ncc2N(C)C(=O)CCN(Cc3ccccc3)c2n1)C(=O)NC1CCN(C)CC1
InChI Key InChIKey=ZMQXLAPSJVDSRK-UHFFFAOYSA-N
Data  2 IC50
  Tab Delimited (TSV)   2D SDfile   Computed 3D by Vconf -m prep SDfile
Find this compound or compounds like it in BindingDB:
Activity Spreadsheet -- Enzyme Inhibition Constant Data from BindingDB
Found 2 hits for monomerid = 89461
TargetProtein Wnt-3a(Mus musculus)
Burnham Center For Chemical Genomics
Curated by PubChem BioAssay
LigandPNGBDBM89461(3-methoxy-4-[[5-methyl-6-oxidanylidene-9-(phenylme...)
Affinity DataIC50: >5.00E+4nM
In DepthDetails PCBioAssay
TargetZinc finger protein GLI1(Mus musculus)
Burnham Center For Chemical Genomics
Curated by PubChem BioAssay
LigandPNGBDBM89461(3-methoxy-4-[[5-methyl-6-oxidanylidene-9-(phenylme...)
Affinity DataIC50:  1.28E+3nM. Assay description: Data Source: Sanford-Burnham Center for Chemical Genomics (SBCCG) Source Affiliation: Sanford-Burnham Medical Research Institute (SBMRI, San Diego, C...
In DepthDetails PCBioAssay