BDBM89502 2-methyl-3-(2-methyl-1-benzimidazolyl)propanoic acid::2-methyl-3-(2-methylbenzimidazol-1-yl)propanoic acid::2-methyl-3-(2-methylbenzimidazol-1-yl)propionic acid::MLS-0466815.0001::cid_6484149
SMILES CC(Cn1c(C)nc2ccccc12)C(O)=O
InChI Key InChIKey=NCUQGGHIAQQHRV-UHFFFAOYSA-N
Data  2 EC50
  Tab Delimited (TSV)   2D SDfile   Computed 3D by Vconf -m prep SDfile
Find this compound or compounds like it in BindingDB:
Activity Spreadsheet -- Enzyme Inhibition Constant Data from BindingDB
Found 2 hits for monomerid = 89502
TargetCaspase-9(Homo sapiens (Human))
Burnham Center For Chemical Genomics
Curated by PubChem BioAssay
LigandPNGBDBM89502(2-methyl-3-(2-methyl-1-benzimidazolyl)propanoic ac...)
Affinity DataEC50: >1.00E+5nM. Assay description: Data Source: Sanford-Burnham Center for Chemical Genomics (SBCCG) Source Affiliation: Sanford-Burnham Medical Research Institute (SBIMR, San Diego, C...
In DepthDetails PCBioAssay
TargetApoptotic protease-activating factor 1(Homo sapiens (Human))
Burnham Center For Chemical Genomics
Curated by PubChem BioAssay
LigandPNGBDBM89502(2-methyl-3-(2-methyl-1-benzimidazolyl)propanoic ac...)
Affinity DataEC50:  9.41E+4nM. Assay description: Data Source: Sanford-Burnham Center for Chemical Genomics (SBCCG) Source Affiliation: Sanford-Burnham Medical Research Institute (SBIMR, San Diego, C...
In DepthDetails PCBioAssay