BDBM89822 2-[2-Oxo-2-(2,2,4-trimethyl-3,4-dihydro-2H-quinolin-1-yl)-ethyl]-isoindole-1,3-dione::2-[2-keto-2-(2,2,4-trimethyl-3,4-dihydroquinolin-1-yl)ethyl]isoindoline-1,3-quinone::2-[2-oxidanylidene-2-(2,2,4-trimethyl-3,4-dihydroquinolin-1-yl)ethyl]isoindole-1,3-dione::2-[2-oxo-2-(2,2,4-trimethyl-3,4-dihydroquinolin-1-yl)ethyl]isoindole-1,3-dione::MLS000526272::SMR000116746::cid_2880983
SMILES CC1CC(C)(C)N(C(=O)CN2C(=O)c3ccccc3C2=O)c2ccccc12
InChI Key InChIKey=KDDHBJICVBONAX-UHFFFAOYSA-N
Data  1 EC50
PDB links: 3 PDB IDs match this monomer.
  Tab Delimited (TSV)   2D SDfile   Computed 3D by Vconf -m prep SDfile
Find this compound or compounds like it in BindingDB:
Activity Spreadsheet -- Enzyme Inhibition Constant Data from BindingDB
Found 1 hit for monomerid = 89822
TargetCorticotropin-releasing factor-binding protein(Homo sapiens (Human))
Burnham Center For Chemical Genomics
Curated by PubChem BioAssay
LigandPNGBDBM89822(2-[2-Oxo-2-(2,2,4-trimethyl-3,4-dihydro-2H-quinoli...)
Affinity DataEC50:  6.44E+3nM. Assay description: Data Source: Sanford-Burnham Center for Chemical Genomics (SBCCG) Source Affiliation: Sanford-Burnham Medical Research Institute (SBMRI, San Diego, C...
In DepthDetails PCBioAssay