BDBM8990 6-methoxy-1,2,3,4-tetrahydroacridin-9-amine::Tacrine Analogue 7
SMILES COc1ccc2c(N)c3CCCCc3nc2c1
InChI Key InChIKey=GCTSJRRFEWSVAJ-UHFFFAOYSA-N
Data  3 IC50
  Tab Delimited (TSV)   2D SDfile   Computed 3D by Vconf -m prep SDfile
Find this compound or compounds like it in BindingDB:
Activity Spreadsheet -- Enzyme Inhibition Constant Data from BindingDB
Found 3 hits for monomerid = 8990
TargetAcetylcholinesterase(Homo sapiens (Human))
University Of Bologna
LigandPNGBDBM8990(6-methoxy-1,2,3,4-tetrahydroacridin-9-amine | Tacr...)
Affinity DataIC50:  350nMpH: 8.0 T: 2°C. Assay description: The cholinesterase assays were performed using colorimetric method reported by Ellman. The appearance of product was monitored at 412 nm for 5 min us...
In DepthDetails ArticlePubMed
TargetAcetylcholinesterase(Homo sapiens (Human))
University Of Bologna
LigandPNGBDBM8990(6-methoxy-1,2,3,4-tetrahydroacridin-9-amine | Tacr...)
Affinity DataIC50:  347nM. Assay description: Inhibitory activity against human erythrocyte acetylcholinesterase
In DepthDetails ArticlePubMed
TargetAcetylcholinesterase(Homo sapiens (Human))
University Of Bologna
LigandPNGBDBM8990(6-methoxy-1,2,3,4-tetrahydroacridin-9-amine | Tacr...)
Affinity DataIC50:  350nM. Assay description: Inhibition of AChE
In DepthDetails ArticlePubMed